{"text_format":"1","workbook":"xlsx","n_sheets":3,"sheets":["Sheet1","Sheet2","Sheet3"],"not_rendered":{"charts":0,"images":0,"macros":0,"external_links":0,"defined_names":0,"comments":0,"pivot_tables":0},"unopened":[],"bounds":{"document_bytes":16777216,"sheet_cells":100000,"rows_first":2000,"rows_last":500,"rows_between":2000,"halvings":0,"cell_chars":16384,"cell_head_chars":4096},"cells_cut":0,"cells_raw":0,"read":"whole","date_system":"1900"}

{"sheet":"Sheet1","index":0,"n_rows":111,"n_cols":22,"rows_kept":111,"cut":false,"hidden":false,"merged":[]}
[null,"Exer. manutenção - Simulação  Automático"]
[null,null,null,null,"exp"]
[null,null,"Tempo bom Func.Vida",null,"Média ",20,"min","max"]
[null,null,"Temp Func. Interm.",null,null,"Uniforme",0,5,"Período Inspecção",null,8]
[null,null,"Custo Peça",null,400]
[null,null,"Custo Inspecção",null,200]
[null,null,"Custo/paragem/Av",null,2000]
[null,null,null,null,null,null,null,null,null,null,null,null,null,null,null,null,null,null,"C. Mensal","C. Mensal","C. Mensal","C. Mensal"]
[null,"Tempo","Tipo","Subst. ","TBF","TBF","Prox","FTI","FDI","Prox.","Próx.","Próximo","Tipo","Nº","Nº ","Nº ",null,null,"Peças","Inspecç","Avarias","Total"]
[null,"dias","Acontec.","Peça?","NPA","dias","T. Inter","NPA","dias","Avaria","Insp","Acontec.","Acontec.","Peças","Insp.","Ava.",null,"D. Padrão",{"$f":"_xlfn.STDEV.P(S12:S111)","v":166.56953337262465},{"$f":"_xlfn.STDEV.P(T12:T111)","v":46.511534697887811},740.57499300431004,843.51314863365917]
[null,0,"Inspecção","Sim",{"$f":"RAND()","v":0.67691091783548807},{"$f":"-$F$3*LN(E11)","v":7.8043119685436668},{"$f":"+B11+F11","v":7.8043119685436668},{"$f":"RAND()","v":0.82631414935341352},{"$f":"+$G$4+H11*($H$4-$G$4)","v":4.1315707467670677},{"$f":"+G11+I11","v":11.935882715310735},{"$f":"+B11+$K$4","v":8},{"$f":"MIN(J11,K11)","v":8},{"$f":"IF(J11>L11,\"Inspecção\", \"Avaria\")","v":"Inspecção"},{"$f":"IF(D11=\"Sim\",1,0)","v":1},{"$f":"IF(C11=\"Inspecção\",1,0)","v":1},{"$f":"IF(MC11=\"Avaria\",1,0)","v":0},null,"Média",{"$f":"AVERAGE(S12:S111)","v":565.32216257141545},{"$f":"AVERAGE(T12:T111)","v":621.56938459132869},2107.9307226849287,3294.822269847672]
[null,{"$f":"+L11","v":8},"Inspecção",{"$f":"IF(L11<G11,\"Não\",\"Sim\")","v":"Sim"},{"$f":"RAND()","v":0.35849731973479926},{"$f":"-$F$3*LN(E12)","v":20.516681906058171},{"$f":"+B12+F12","v":28.516681906058171},{"$f":"RAND()","v":1.2679450998160147E-2},{"$f":"+$G$4+H12*($H$4-$G$4)","v":6.3397254990800733E-2},{"$f":"+G12+I12","v":28.580079161048971},{"$f":"+B12+$K$4","v":16},{"$f":"MIN(J12,K12)","v":16},{"$f":"IF(J12>L12,\"Inspecção\", \"Avaria\")","v":"Inspecção"},{"$f":"IF(D12=\"Sim\",1,0)","v":1},{"$f":"IF(C12=\"Inspecção\",1,0)","v":1},{"$f":"IF(C12=\"Avaria\",1,0)","v":0},null,null,{"$f":"+G43","v":376.91575089430671},{"$f":"+G44","v":619.21873361207543},{"$f":"+G45","v":1615.3532181184573},{"$f":"+G46","v":2611.4877026248396}]
[null,16,"Inspecção",{"$f":"IF(L12<G12,\"Não\",\"Sim\")","v":"Não"},0.19197983822434572,{"$f":"-$F$3*LN(E13)","v":33.007298434328241},49.007298434328241,{"$f":"RAND()","v":0.67123792375292046},{"$f":"+$G$4+H13*($H$4-$G$4)","v":3.3561896187646023},52.363488053092844,24,{"$f":"MIN(J13,K13)","v":24},"Inspecção",0,1,0,null,1,607.754899981525,607.754899981525,2734.8970499168627,3950.4068498799124]
[null,24,"Inspecção","Não",8.4934569527894799E-2,49.317481783542753,73.317481783542746,0.73842382670386231,3.6921191335193115,77.009600917062059,32,32,"Inspecção",0,1,0,null,{"$f":"1+R13","v":2},655.47734747618506,625.6829225909039,2383.553990822491,3664.7142608895797]
[null,32,"Inspecção","Não",0.6367058110885776,9.0289513022879326,41.028951302287936,0.37936231271452503,1.896811563572625,42.925762865860563,40,40,"Inspecção",0,1,0,null,{"$f":"1+R14","v":3},736.64787984392058,566.65221526455434,2549.9349686904943,3853.2350637989693]
[null,40,"Inspecção","Não",0.65002374548733899,8.6149277048146171,48.614927704814619,0.44283897919055226,2.2141948959527613,50.829122600767377,48,48,"Inspecção",0,1,0,null,4,647.11219509197031,588.28381371997307,2647.2771617398789,3882.6731705518223]
[null,48,"Inspecção","Não",0.79867222588087217,4.4960929564068719,52.496092956406869,0.42250752475224473,2.1125376237612237,54.608630580168096,56,54.608630580168096,"Avaria",0,1,0,null,5,566.81868870170604,623.50055757187658,1983.865410455971,3174.1846567295538]
[null,54.608630580168096,"Avaria","Sim",0.8013968317760235,4.4279806829899053,59.036611263158001,0.64330613129378034,3.2165306564689016,62.253141919626906,62.608630580168096,62.253141919626906,"Avaria",1,0,1,null,6,398.36491199080092,626.00200455697279,1991.8245599540044,3016.1914765017782]
[null,62.253141919626906,"Avaria","Sim",0.4051350802771897,18.070694718725274,80.323836638352176,0.60091108443078711,3.0045554221539357,83.328392060506118,70.253141919626898,70.253141919626898,"Inspecção",{"$f":"IF(D19=\"Sim\",1,0)","v":1},0,{"$f":"IF(C19=\"Avaria\",1,0)","v":1},null,7,402.08969673117059,660.57593034406602,1723.2415574193026,2785.9071844945393]
[null,70.253141919626898,"Inspecção","Não",0.88640541133434525,2.411617163260972,72.664759082887869,0.9717876601885298,4.8589383009426488,77.523697383830523,78.253141919626898,77.523697383830523,"Avaria",0,1,0,null,8,348.17191855669648,696.34383711339296,1450.7163273195686,2495.232082989658]
[null,77.523697383830523,"Avaria","Sim",0.2541209640976696,27.398897774465265,104.92259515829579,0.20971125368788957,1.0485562684394478,105.97115142673523,85.523697383830523,85.523697383830523,"Inspecção",1,0,1,null,9,627.70889610462814,599.17667355441779,2282.5778040168298,3509.463373675876]
[null,85.523697383830523,"Inspecção","Não",0.61245609534584666,9.8055604040094195,95.329257787839936,0.26712382910003107,1.3356191455001554,96.664876933340096,93.523697383830523,93.523697383830523,"Inspecção",0,1,0,null,10,476.88955219775067,635.85273626366745,1324.6932005493072,2437.4354890107256]
[null,93.523697383830523,"Inspecção","Não",0.19736302043222165,32.454210054038178,125.97790743786871,0.62748141030803961,3.1374070515401979,129.11531448940892,101.52369738383052,101.52369738383052,"Inspecção",0,1,0,null,11,440.91767350313785,633.81915566076066,1653.4412756367669,2728.1781048006651]
[null,101.52369738383052,"Inspecção","Não",0.83278875671541697,3.6595052470876728,105.1832026309182,0.19439307316086729,0.97196536580433646,106.15516799672254,109.52369738383052,106.15516799672254,"Avaria",0,1,0,null,12,272.87066561011665,682.17666402529176,1091.4826624404666,2046.5299920758753]
[null,106.15516799672254,"Avaria","Sim",0.39828032367145116,18.411983815789227,124.56715181251177,0.22334772997259911,1.1167386498629956,125.68389046237476,114.15516799672254,114.15516799672254,"Inspecção",1,0,1,null,13,397.71180629761335,653.38368177465054,1704.4791698469141,2755.5746579191782]
[null,114.15516799672254,"Inspecção","Não",0.14289003163531611,38.913599082099822,153.06876707882236,0.69832976960883297,3.4916488480441648,156.56041592686654,122.15516799672254,122.15516799672254,"Inspecção",0,1,0,null,14,465.12070170228986,610.47092098425549,2325.6035085114495,3401.1951311979947]
[null,{"$f":"+L26","v":122.15516799672254},{"$f":"+M26","v":"Inspecção"},{"$f":"IF(L26<G26,\"Não\",\"Sim\")","v":"Não"},0.15731963377606584,36.989513186260268,{"$f":"+B27+F27","v":159.14468118298282},0.39555011730681189,1.9777505865340594,{"$f":"+G27+I27","v":161.12243176951688},{"$f":"+B27+$K$4","v":130.15516799672253},{"$f":"MIN(J27,K27)","v":130.15516799672253},{"$f":"IF(J27>L27,\"Inspecção\", \"Avaria\")","v":"Inspecção"},{"$f":"IF(D27=\"Sim\",1,0)","v":0},1,0,null,15,571.59011835992419,628.74913019591668,2000.565414259735,3200.9046628155761]
[null,130.15516799672253,"Inspecção","Não",0.30087038872806304,24.021514184027474,154.17668218074999,0.28423188091196405,1.4211594045598201,155.59784158530982,138.15516799672253,138.15516799672253,"Inspecção",0,1,0,null,16,740.50659901526876,586.23439088708778,3085.44416256362,4412.185152465976]
[null,138.15516799672253,"Inspecção","Não",9.9400788423671393E-2,46.171904670467711,184.32707266719024,0.52729958246818698,2.6364979123409347,186.96357057953117,146.15516799672253,146.15516799672253,"Inspecção",0,1,0,null,17,560.53279687185693,644.61271640263544,1681.5983906155707,2886.7439038900634]
[null,146.15516799672253,"Inspecção","Não",5.1805602708917986E-2,59.205139503235849,205.36030749995837,0.60085241065621942,3.0042620532810971,208.36456955323948,154.15516799672253,154.15516799672253,"Inspecção",0,1,0,null,18,557.09302861326069,640.65698290524972,1671.2790858397821,2869.0290973582923]
[null,{"$f":"+L30","v":154.15516799672253},{"$f":"+M30","v":"Inspecção"},{"$f":"IF(L30<G30,\"Não\",\"Sim\")","v":"Não"},0.89521933458325698,2.2137304831543556,{"$f":"+B31+F31","v":156.36889847987689},0.80973025676503374,4.0486512838251691,{"$f":"+G31+I31","v":160.41754976370206},{"$f":"+B31+$K$4","v":162.15516799672253},{"$f":"MIN(J31,K31)","v":160.41754976370206},{"$f":"IF(J31>L31,\"Inspecção\", \"Avaria\")","v":"Avaria"},{"$f":"IF(D31=\"Sim\",1,0)","v":0},1,0,null,19,635.0127434458708,606.14852783469485,2309.1372488940756,3550.2985201746415]
[null,160.41754976370206,"Avaria","Sim",0.58206252488279586,10.823548119018147,171.2410978827202,0.96442478582821367,4.8221239291410685,176.06322181186127,168.41754976370206,168.41754976370206,"Inspecção",1,0,1,null,20,514.03693589863622,656.82497364825747,1713.4564529954544,2884.318362542348]
[null,168.41754976370206,"Inspecção","Não",0.72985197795646306,6.2982707064590757,174.71582047016113,2.913080247633526E-2,0.1456540123816763,174.8614744825428,176.41754976370206,174.8614744825428,"Avaria",0,1,0,null,21,436.26336921576274,654.39505382364416,1363.3230287992587,2453.9814518386652]
[null,174.8614744825428,"Avaria","Sim",0.43496771747436225,16.649669266999346,191.51114374954216,0.86491683278086218,4.3245841639043112,195.83572791344648,182.8614744825428,182.8614744825428,"Inspecção",1,0,1,null,22,557.13215242163358,612.84536766379699,1949.9625334757179,3119.9400535611485]
[null,182.8614744825428,"Inspecção","Não",5.216187330279376E-2,59.068068949224504,241.92954343176731,0.58806264406149156,2.9403132203074578,244.86985665207476,190.8614744825428,190.8614744825428,"Inspecção",0,1,0,null,23,325.55492307161603,623.98026922059728,1627.7746153580799,2577.3098076502934]
[null,190.8614744825428,"Inspecção","Não",0.22907505812974072,29.474111287446767,220.33558576998956,0.84197799848284471,4.2098899924142232,224.54547576240378,198.8614744825428,198.8614744825428,"Inspecção",0,1,0,null,24,505.31243784501635,617.60409069946434,1965.1039249528415,3088.0204534973218]
[null,198.8614744825428,"Inspecção","Não",0.36125098653071952,20.363646173566789,219.2251206561096,0.28498981148070734,1.4249490574035368,220.65006971351312,206.8614744825428,206.8614744825428,"Inspecção",0,1,0,null,25,565.51747005519724,650.3450905634769,1696.5524101655922,2912.4149707842662]
[null,206.8614744825428,"Inspecção","Não",6.2777144539692631E-2,55.363284244022736,262.22475872656554,0.97587361210697188,4.8793680605348593,267.10412678710043,214.8614744825428,214.8614744825428,"Inspecção",0,1,0,null,26,584.93051258228911,672.67008946963256,1754.7915377468676,3012.3921397987892]
[null,214.8614744825428,"Inspecção","Não",0.58857900835331478,10.600882150132149,225.46235663267495,0.977786780370828,4.8889339018541396,230.35129053452908,222.8614744825428,222.8614744825428,"Inspecção",0,1,0,null,27,737.31835054839598,614.43195879032999,2764.943814556485,4116.6941238952104]
[null,222.8614744825428,"Inspecção","Não",0.7314240450461964,6.2552379687289701,229.11671245127178,0.35906048632245258,1.7953024316122628,230.91201488288405,230.8614744825428,230.8614744825428,"Inspecção",0,1,0,null,28,585.03605890115216,585.03605890115216,2632.6622650551849,3802.7343828574894]
[null,null,null,null,null,null,null,null,null,null,null,null,null,{"$f":"SUM(N12:N40)","v":7},{"$f":"SUM(O12:O40)","v":23},6,null,29,679.01577824438129,594.13880596383376,2263.3859274812712,3536.5405116894863]
[null,null,null,null,"Total","Dia","Mês",null,null,null,null,null,null,null,null,null,null,30,479.299791889137,659.03721384756341,2096.9365895149745,3235.273595251675]
[null,"Custo das peças",null,null,{"$f":"N41*E5","v":2800},{"$f":"+E43/$B$40","v":12.563858363143558},{"$f":"+F43*30","v":376.91575089430671},null,"     Intervalo de Confiança a ",null,null,0.95,null,null,null,null,null,31,465.21647278181445,639.67265007499498,2035.3220684204384,3140.211191277248]
[null,"Custo das Inspecções",null,null,{"$f":"+O41*E6","v":4600},{"$f":"+E44/$B$40","v":20.640624453735846},{"$f":"+F44*30","v":619.21873361207543},null,null,"Custos Mensais Totais",null,null,null,null,null,null,null,32,391.03907158637918,642.42133189190872,1675.8817353701966,2709.3421388484844]
[null,"Custos das Avarias",null,null,{"$f":"+E7*P41","v":12000},53.845107270615244,1615.3532181184573,null,null,null,null,null,null,null,null,null,null,33,610.03469441935579,640.53642914032355,2440.1387776774231,3690.7099012371023]
[null,"Custo Total",null,null,{"$f":"+E43+E44+E45","v":19400},87.04959008749465,2611.4877026248396,null,"Limite Inferior",null,null,"Limite Superior",null,null,null,null,null,34,493.04182093865774,629.99788231050707,1643.4727364621924,2766.5124397113573]
[null,null,null,null,null,null,null,null,{"$f":"+$V$11-$V$10/SQRT($R$111+1)*TINV(1-$L$43,$R$111)","v":3127.4509610071782},null,null,{"$f":"+$V$11+$V$10/SQRT($R$111+1)*TINV(1-$L$43,$R$111)","v":3462.1935786881659},null,null,null,null,null,35,781.10282523477872,570.80591074849212,3004.2416355183796,4356.1503715016506]
[null,null,null,null,null,null,null,null,null,null,null,null,null,null,null,null,null,36,454.79090861718703,653.76193113720637,1705.4659073144514,2814.0187470688443]
[null,null,null,null,null,null,null,null,null,null,null,null,null,null,null,null,null,37,767.33669750014019,575.50252312510509,3516.959863542309,4859.7990841675537]
[null,null,null,null,null,null,null,null,null,null,null,null,null,null,null,null,null,38,589.34114723177731,589.34114723177731,2652.035162542998,3830.7174570065526]
[null,null,null,null,null,null,null,null,null,null,null,null,null,null,null,null,null,39,747.06013182073798,603.3947218552114,2298.6465594484243,3649.1014131243737]
[null,null,null,null,null,null,null,null,null,null,null,null,null,null,null,null,null,40,735.53051360461222,582.29498993698462,3064.7104733525507,4382.535976894148]
[null,null,null,null,null,null,null,null,null,null,null,null,null,null,null,null,null,41,622.37527150832159,622.37527150832159,1980.284954799205,3225.035497815848]
[null,null,null,null,null,null,null,null,null,null,null,null,null,null,null,null,null,42,383.72191302520946,657.80899375750187,1370.4354036614623,2411.9663104441738]
[null,null,null,null,null,null,null,null,null,null,null,null,null,null,null,null,null,43,267.01292520958299,694.2336055449158,801.03877562874902,1762.2853063832479]
[null,null,null,null,null,null,null,null,null,null,null,null,null,null,null,null,null,44,683.0086468785961,569.17387239882999,2561.282425794735,3813.4649450721608]
[null,null,null,null,null,null,null,null,null,null,null,null,null,null,null,null,null,45,786.43654626213436,574.70362996079052,3024.7559471620557,4385.8961233849805]
[null,null,null,null,null,null,null,null,null,null,null,null,null,null,null,null,null,46,508.39223910450102,564.88026567166787,2541.961195522505,3615.2337002986737]
[null,null,null,null,null,null,null,null,null,null,null,null,null,null,null,null,null,47,926.51543347189249,586.79310786553197,3088.3847782396415,4601.6933195770653]
[null,null,null,null,null,null,null,null,null,null,null,null,null,null,null,null,null,48,752.09639334425378,595.40964473086763,3133.7349722677245,4481.2410103428456]
[null,null,null,null,null,null,null,null,null,null,null,null,null,null,null,null,null,49,659.06169772971111,629.104347832906,2396.587991744404,3684.7540373070215]
[null,null,null,null,null,null,null,null,null,null,null,null,null,null,null,null,null,50,508.29602251727425,621.25069418777957,1976.7067542338443,3106.2534709388983]
[null,null,null,null,null,null,null,null,null,null,null,null,null,null,null,null,null,51,379.97048204933242,651.377969227427,1357.0374358904728,2388.3858871672323]
[null,null,null,null,null,null,null,null,null,null,null,null,null,null,null,null,null,52,698.44121059463282,582.03434216219409,2619.1545397298737,3899.6300924867005]
[null,null,null,null,null,null,null,null,null,null,null,null,null,null,null,null,null,53,477.66950041025865,656.79556306410575,2089.8040642948818,3224.2691277692461]
[null,null,null,null,null,null,null,null,null,null,null,null,null,null,null,null,null,54,517.35709367362392,661.0673974718527,1724.5236455787463,2902.9481367242229]
[null,null,null,null,null,null,null,null,null,null,null,null,null,null,null,null,null,55,487.08368960775448,649.4449194770059,1353.010248910429,2489.5388579951896]
[null,null,null,null,null,null,null,null,null,null,null,null,null,null,null,null,null,56,161.25253155930912,698.76097009033947,806.26265779654568,1666.2761594461942]
[null,null,null,null,null,null,null,null,null,null,null,null,null,null,null,null,null,57,452.82965948923965,622.64078179770445,1981.1297602654233,3056.6002015523677]
[null,null,null,null,null,null,null,null,null,null,null,null,null,null,null,null,null,58,668.88662772680971,608.07875247891786,2736.3543861551302,4013.3197663608585]
[null,null,null,null,null,null,null,null,null,null,null,null,null,null,null,null,null,59,609.25882876956371,636.95241189545288,1661.6149875533556,2907.8262282183723]
[null,null,null,null,null,null,null,null,null,null,null,null,null,null,null,null,null,60,524.47646988265785,641.02679652324855,2039.6307162103362,3205.133982616243]
[null,null,null,null,null,null,null,null,null,null,null,null,null,null,null,null,null,61,269.44429785247837,673.61074463119587,1077.7771914099135,2020.8322338935873]
[null,null,null,null,null,null,null,null,null,null,null,null,null,null,null,null,null,{"$f":"1+R73","v":62},548.94626049948624,686.18282562435775,1097.8925209989725,2333.0216071228165]
[null,null,null,null,null,null,null,null,null,null,null,null,null,null,null,null,null,63,377.00152225284057,673.21700402292959,1077.1472064366874,2127.3657327124574]
[null,null,null,null,null,null,null,null,null,null,null,null,null,null,null,null,null,64,505.2668948396423,645.61881007287639,1684.2229827988078,2835.1086877113262]
[null,null,null,null,null,null,null,null,null,null,null,null,null,null,null,null,null,65,610.33313697703079,638.07555229416857,1664.5449190282659,2912.953608299465]
[null,null,null,null,null,null,null,null,null,null,null,null,null,null,null,null,null,66,648.4336301239648,589.48511829451343,2652.6830323253103,3890.6017807437888]
[null,null,null,null,null,null,null,null,null,null,null,null,null,null,null,null,null,{"$f":"1+R78","v":67},698.77248664764511,553.19488526271903,2911.5520276985208,4163.5193996088847]
[null,null,null,null,null,null,null,null,null,null,null,null,null,null,null,null,null,68,330.0814116747182,687.66960765566284,1100.2713722490605,2118.0223915794418]
[null,null,null,null,null,null,null,null,null,null,null,null,null,null,null,null,null,69,765.80176700131426,574.35132525098561,3509.9247654226901,4850.0778576749899]
[null,null,null,null,null,null,null,null,null,null,null,null,null,null,null,null,null,70,565.63782042214325,565.63782042214325,2545.3701918996444,3676.6458327439314]
[null,null,null,null,null,null,null,null,null,null,null,null,null,null,null,null,null,71,331.05595057422244,717.28789291081523,827.63987643555606,1875.9837199205938]
[null,null,null,null,null,null,null,null,null,null,null,null,null,null,null,null,null,72,926.90774212764347,463.45387106382174,3765.5627023935513,5155.9243155850172]
[null,null,null,null,null,null,null,null,null,null,null,null,null,null,null,null,null,73,612.42029077559107,556.74571888690093,2505.3557349910543,3674.5217446535462]
[null,null,null,null,null,null,null,null,null,null,null,null,null,null,null,null,null,74,588.75738592551818,618.19525522179413,2355.0295437020727,3561.9821848493852]
[null,null,null,null,null,null,null,null,null,null,null,null,null,null,null,null,null,75,534.6475190933362,594.05279899259574,2673.2375954666809,3801.9379135526128]
[null,null,null,null,null,null,null,null,null,null,null,null,null,null,null,null,null,76,215.79823122273373,701.34425147388458,809.24336708525152,1726.3858497818699]
[null,null,null,null,null,null,null,null,null,null,null,null,null,null,null,null,null,77,350.49342706945896,700.98685413891792,1460.3892794560793,2511.869560664456]
[null,null,null,null,null,null,null,null,null,null,null,null,null,null,null,null,null,78,529.81738812200524,688.76260455860688,794.72608218300797,2013.3060748636201]
[null,null,null,null,null,null,null,null,null,null,null,null,null,null,null,null,null,79,818.56852697400132,526.22262448328661,3215.8049273978622,4560.5960788551502]
[null,null,null,null,null,null,null,null,null,null,null,null,null,null,null,null,null,80,666.99660563339035,606.3605505758095,2728.6224775911423,4001.9796338003421]
[null,null,null,null,null,null,null,null,null,null,null,null,null,null,null,null,null,81,732.44450764921476,563.4188520378575,2535.3848341703588,3831.248193857431]
[null,null,null,null,null,null,null,null,null,null,null,null,null,null,null,null,null,82,640.61833312520093,553.26128769903721,2911.9015142054591,4105.781135029697]
[null,null,null,null,null,null,null,null,null,null,null,null,null,null,null,null,null,83,619.11436761535026,619.11436761535026,2786.0146542690759,4024.2433894997766]
[null,null,null,null,null,null,null,null,null,null,null,null,null,null,null,null,null,84,853.43650620286405,579.11762920908632,3047.9875221530856,4480.5416575650361]
[null,null,null,null,null,null,null,null,null,null,null,null,null,null,null,null,null,85,694.3936853508626,568.1402880143421,3471.968426754313,4734.5024001195179]
[null,null,null,null,null,null,null,null,null,null,null,null,null,null,null,null,null,86,558.62183106205862,558.62183106205862,2513.7982397792639,3631.0419019033807]
[null,null,null,null,null,null,null,null,null,null,null,null,null,null,null,null,null,87,1055.9012134133166,465.83877062352195,4347.8285258195383,5869.5685098563772]
[null,null,null,null,null,null,null,null,null,null,null,null,null,null,null,null,null,88,522.91108255476865,639.11354534471718,2033.5430988240998,3195.567726723586]
[null,null,null,null,null,null,null,null,null,null,null,null,null,null,null,null,null,89,603.57927099661208,633.75823454644285,2414.3170839864483,3651.6545895295035]
[null,null,null,null,null,null,null,null,null,null,null,null,null,null,null,null,null,90,268.39502321314001,697.82706035416402,805.18506963942002,1771.4071532067242]
[null,null,null,null,null,null,null,null,null,null,null,null,null,null,null,null,null,91,622.41491919279451,622.41491919279451,1980.4111065225284,3225.2409449081174]
[null,null,null,null,null,null,null,null,null,null,null,null,null,null,null,null,null,92,643.58152672254937,616.76562977577646,1608.9538168063732,2869.3009733046993]
[null,null,null,null,null,null,null,null,null,null,null,null,null,null,null,null,null,93,640.66061844272735,694.0490033129546,800.82577305340919,2135.535394809091]
[null,null,null,null,null,null,null,null,null,null,null,null,null,null,null,null,null,{"$f":"1+R105","v":94},680.528353300464,623.81765719209193,1984.8743637930197,3289.2203742855754]
[null,null,null,null,null,null,null,null,null,null,null,null,null,null,null,null,null,{"$f":"1+R106","v":95},564.79699289008033,593.03684253458437,2259.1879715603213,3417.0218069849861]
[null,null,null,null,null,null,null,null,null,null,null,null,null,null,null,null,null,96,382.96188999237313,656.50609712978246,1367.7210356870469,2407.1890228092029]
[null,null,null,null,null,null,null,null,null,null,null,null,null,null,null,null,null,97,382.05156294570207,654.94553647834641,1364.4698676632217,2401.4669670872699]
[null,null,null,null,null,null,null,null,null,null,null,null,null,null,null,null,null,98,1000.277569119679,593.91480666480948,3125.8674034989972,4720.059779283486]
[null,null,null,null,null,null,null,null,null,null,null,null,null,null,null,null,null,99,606.98158932931733,634.57166157155905,1655.4043345345017,2896.9575854353784]

{"sheet":"Sheet2","index":1,"n_rows":0,"n_cols":0,"rows_kept":0,"cut":false,"hidden":false,"merged":[]}

{"sheet":"Sheet3","index":2,"n_rows":0,"n_cols":0,"rows_kept":0,"cut":false,"hidden":false,"merged":[]}